Compilation failed.
e_18282.c:5:15: error: called object type 'int' is not a function or function pointer c = (a-b) (a+b); e_18282.c:7:22: error: expected ';' in 'for' statement specifier for(i=0, i<c, i++) ^ e_18282.c:7:22: error: expected ';' in 'for' statement specifier e_18282.c:8:21: error: expected ')' printf("i=" i); ^ 1 warning and 4 errors generated.